List of issues

'No such otk "kzCZbam9rVDrD7USydMjTh2uUYOKEDfF"'

ID Activity Title Status Creator Assigned To
2446 yesterday Support SNI for SSL/TLS open zyasoft  
2447 yesterday Support server-side STARTTLS for SSL open zyasoft  
2458 yesterday Support Tornado web server open zyasoft  
2460 yesterday Wrong result when multiplying complex numbers involving infinity open jsaiz zyasoft
2413 yesterday ElementTree.write doesn't close files if used with invalid encoding open pekka.klarck  
2442 yesterday Overriding __len__, __iter__, and __getitem__ in a tuple subclass causes an infinite recursion open ceridwen zyasoft
2429 2 days ago cStringIO does not work with bytearray objects open pekka.klarck  
2457 2 days ago Synchronization bug in PySystemStateCloser causes complete deadlock pending nickmbailey stefan.richthofer
2399 2 days ago regrtest failures related to sort() on Java 8 open jeff.allen  
2459 2 days ago Triple quotes are not parsed properly by the console open jsaiz  
2124 2 days ago xml.dom.minidom.writexml() changes value of TEXT_NODE pending kuhstall  
2455 2 days ago Java classes in packages with __init__.py not found open jsaiz zyasoft
2456 3 days ago java.util.List.remove(index) does not dispatch to overloaded method for index remove pending jsaiz zyasoft
2434 3 days ago zlib module has different flush behaviour than CPython and PyPy pending lukasa zyasoft
2406 4 days ago socket.IPV6_V6ONLY is missing from Jython 2.7 open mishikal@yahoo.com  
2350 4 days ago Installer errors on ensurepip pending joshfriend  
2454 4 days ago Security Vulnerability in Jython pending cschneider4711  
1943 1 week ago missing module fcntl open wbrana  
2412 2 weeks ago Jython does not terminate process when used with loadwatch open iMichka  
2363 3 weeks ago relative seeks works incorrectly after readline open amit  
2427 3 weeks ago jython --boot cannot load console support on Windows open eaaltonen  
2445 3 weeks ago Eclipse's DelegatingFeatureMap has MRO conflict open tomluk  
2182 3 weeks ago Build Jython with Gradle open hjacobs  
2362 3 weeks ago Import * doesn't work on JDK9 open sfelts  
2378 3 weeks ago Current docs aren't. open tchaypo  
2199 3 weeks ago [2.5] Memory Leak when create many Interpreters open Adel fwierzbicki
2041 3 weeks ago solrpy: testscript runs in python, but not jython open StefanGeissler  
2186 3 weeks ago Windows installation docs should mention possibility of adding Jython bin to PATH open cmbannan  
1485 3 weeks ago JSR223 ScriptEngineManager cannot find both jython and jruby ScriptEngines when using maven assembly plugin open heuermh  
2269 3 weeks ago jffi*.tmp files left to %TMP% on Windows open pekka.klarck  
2270 3 weeks ago jansi-*.dll left to %TMP% on Windows open pekka.klarck  
2169 3 weeks ago buffer/memoryview objects should be valid arguments for Java methods taking byte[] parameters open zyasoft  
2419 3 weeks ago List expected failures by OS platform in regrtest.py open jeff.allen  
1699 1 month ago jsr-223 scope object is not dict-like open pjenvey  
1756 1 month ago Document the use of jarray and array better with respect to zeros function open gmseed  
2449 1 month ago requests library causes memory leak and 100% GC time when handling keep-alive open latifrons  
2373 1 month ago jython 2.7.0 Console.py Demo does not work open saltnlight5  
1152612 1 month ago PyStringMap does not fully behave as a dict open anonymous  
2293 1 month ago "java.lang.IllegalArgumentException: java.lang.IllegalArgumentException: Cannot create PyString with non-byte value" triggered after adding unicode element with non-ASCII character to sys.path open Arfrever jeff.allen
1965 1 month ago Unable to match long strings with re open thatch  
2101 1 month ago Diamond-style multiple inheritance fails when using __slots__ on the second branch open cdleonard  
2143 1 month ago site-packages support in standalone jar open nonameentername zyasoft
2320 1 month ago fileno() is -1 on Windows open jeff.allen jeff.allen
2230 1 month ago Jython evaluation blocks under heavy load with high multi-core systems open wdroste  
2305 1 month ago sys.ps1 and sys.ps2 mentioned in dir(sys) in non-interactive mode open Arfrever  
2216 1 month ago BigInteger(10L) > 100 returns True open santa4nt  
1906 1 month ago DeprecationWarnings, ImportWarnings and PendingDeprecationWarnings do not work in Jython 2.7 open Arfrever fwierzbicki
1127 1 month ago Jython has problems to dynamically loading classes when installed on the boot classpath open leosoto  
2288 1 month ago 'IllegalArgumentException: java.lang.IllegalArgumentException: Cannot create PyString with non-byte value' and 'NullPointerException: java.lang.NullPointerException' triggered by test suite of Sphinx 1.3 open Arfrever  
1720 1 month ago Support environment variable flags open pjenvey  
Download as CSV
Sort on: Descending:
Descending:
Group on: Descending:
Descending: