List of issues

ID Activity Title Status Creator Assigned To
2182 1 month ago Jython should support Maven build with pom.xml open hjacobs  
1861 1 month ago Triage FIXME skips/other changes in regrtest specific to Jython open fwierzbicki  
2216 1 month ago BigInteger(10L) > 100 returns True open santa4nt  
2124 1 month ago xml.dom.minidom.writexml() changes value of TEXT_NODE open kuhstall  
2291 1 month ago Allow to set version-related attributes in sys module open Arfrever  
2035 1 month ago datetime.date.fromtimestamp(None) should raise TypeError open cht  
2185 1 month ago expatreader.py not included in Jython open fwierzbicki  
1442 1 month ago No os.W* attributes open pjdm  
2290 1 month ago Setting of attributes of sys module raises internal exceptions in case of some attributes open Arfrever  
2299 1 month ago Support macropy open zyasoft  
2331 1 month ago "java.lang.IllegalArgumentException: Cannot create PyString with non-byte value" caused by non-ASCII characters in _socket.error.args[1] with unicode type open Arfrever  
2286 1 month ago 'IllegalArgumentException: java.lang.IllegalArgumentException: Cannot create PyString with non-byte value' triggered by test suite of autopep8 1.1.1 open Arfrever  
1726 1 month ago Interaction problem w/ emacs shells on windows open gma  
1723 1 month ago stdout not working; print redirected to stderr? open jasonsmith  
1423 1 month ago Circular imports cause RuntimeError: maximum recursion depth exceeded open Lonebuddha jeff.allen
1641 1 month ago Jars loaded dynamically from sys.path do not load their full manifest into their package open zyasoft  
1734 1 month ago no integration with java.math.BigDecimal and java.math.BigInteger open doublep  
1002 1 month ago static java methods on class hidden by object methods open crotwell  
1911 1 month ago "All" installation doesn't generate standalone jar open rberdeen  
1823 1 month ago jython launcher bash script induces terminal malfunction open slestak  
2077 1 month ago marshal doesn't raise error when fed unmarshalable object open irmen  
2329 1 month ago Cannot create virtualenv with jython2.7rc2 - breaks tox open csojinb  
2320 1 month ago fileno() is -1 on Windows open jeff.allen jeff.allen
1719817 1 month ago thread.start_new_thread doesn't take a kwarg dict open cgroves  
2115 1 month ago Callable objects cannot be used as args to Java method params taking single method interfaces open zyasoft  
1842 1 month ago Add IBM i support to Jython open ryanwatkins  
2213 1 month ago socket.setsockopt(socket.SOL_SOCKET, socket.SO_RCVBUF, tcp_window_size) with huge tcp_window_size does not raise an exception open dstromberg  
1767 1 month ago Rich comparisons open egg  
2039 1 month ago __future__.unicode_literals doesn't affect eval open gsnedders  
1014 1 month ago Patch for inspect.getargspec to work with PyReflectedFunction open crotwell nobody
2223 1 month ago __file__ not defined when running from ScriptEngine open jythonuser1  
1152612 1 month ago PyStringMap does not fully behave as a dict open anonymous  
2029 1 month ago The codeop.Compile class does not expose compiler flags as expected open seletz  
2285 1 month ago _strptime broken with non-English locales open Arfrever  
2250 1 month ago Update standard library in lib-python/2.7 to 2.7.9 open zyasoft  
1953 1 month ago lib2to3 missing open Arfrever  
2099 1 month ago No way to serialize interpreter state open stepleton  
2318 1 month ago test_zipimport_jy failure on Windows open jeff.allen  
2317 1 month ago test_urllib2 failure on Windows open jeff.allen  
2316 1 month ago test_tarfile file-mode failures on Windows open jeff.allen  
2312 1 month ago Test failures related to encoding in a subprocess on Windows open jeff.allen  
2315 1 month ago test_ssl failure on Windows open jeff.allen  
2314 1 month ago test_shutil failures on Windows open jeff.allen  
2313 1 month ago test_jython_initializer failure on Windows open jeff.allen  
2309 1 month ago test_classpathimporter fails on Windows. open jeff.allen  
547727 2 months ago Class-path in jar manifest is ignored open anonymous  
2295 2 months ago Importation of modules with str names with non-ASCII characters fails open Arfrever  
2294 2 months ago Importation of modules from directories with non-ASCII characters fails open Arfrever  
1915 2 months ago Locale set without call to locale.setlocale() open Arfrever  
2270 2 months ago jansi-*.dll left to %TMP% on Windows open pekka.klarck  
Download as CSV
Sort on: Descending:
Descending:
Group on: Descending:
Descending: