List of issues - Show Unassigned

ID Activity Title Status Creator
(no priority set)
2374 2 days ago setsockopt call from pika fails with "Protocol not available"error open mbakht
2372 6 days ago Wildcard import fails when used with absolute_import pending dcoles
2373 1 week ago jython 2.7.0 Console.py Demo does not work on Windows 7 open saltnlight5
2338 1 week ago readline.py startup hook open eaaltonen
2370 1 week ago The behavior of os.makedirs changed between jython 2.5.1 and 2.5.2 pending sefas
2371 1 week ago Jython does not handle signal.SIGALRM correctly pending the
2367 2 weeks ago Jython ignores custom __eq__ when hashing dict subclasses open clevy
2369 2 weeks ago running jython-standalone.jar in desktops with with korean language account open chasook5
2366 3 weeks ago Subclassing of socket.socket broken open Arfrever
2368 3 weeks ago Problem with _io and BlockingIOError open akalinovski
2358 3 weeks ago Jython fails to open readable file under /proc on Linux open dstromberg
2365 1 month ago Jython/pip javax.net.ssl.SSLException: handshake timed out open alexgs
2363 1 month ago relative seeks works incorrectly after readline open amit
2361 1 month ago Performance benchmarks open zyasoft
2360 1 month ago Not installing pip on Jython open thavihaz909
2346 1 month ago Launcher (bin/jython.exe, bin/jython) is not resilient to bad environment variable settings open adamburke
2321 1 month ago Need better API and docs for using PySystemState open kevinmcmurtrie
2359 1 month ago Many Java-defined functions do not accept keyword arguments open jdemoor
2350 1 month ago Installer errors on ensurepip open joshfriend
2357 1 month ago Infinite recursion with set subclass open jdemoor
2356 1 month ago java.lang.IllegalArgumentException while startup jython on Windows 8.1 with current username is not ASCII characters open liuxy_hes86
2353 1 month ago jython.exe a 32-bit program on 64-bit Win8.1 even when installed with 64-bit Java - related to Issue2346 open GelattD
2355 1 month ago Jython fails to import python modules from Lib when embedded in an eclipse plug-in open otto_fajardo
2354 1 month ago marshal.py does not support serialization of code open fmartins
2348 1 month ago site module does not import if usernames contain non-ascii characters open fwierzbicki
2351 1 month ago Creating Lib.jar from the Lib directory open sergei175
2343 2 months ago PYTHONPATH is overwritten on Windows open pekka.klarck
2339 2 months ago JSR223: NullPointerException in Eclipse following wiki instructions open eaaltonen
2345 2 months ago Installing pip fails if JYTHON_HOME set and points to old installation open pekka.klarck
2344 2 months ago `jython` start-up script not anymore directly under installation directory open pekka.klarck
2340 2 months ago Support isolated surrogate codepoints in unicode with UCS4 encoding open zyasoft
2342 2 months ago Raw strings get different exception for lone surrogates open gsnedders
2341 2 months ago Invalid Unicode string literals cause console to keep outputting "..." open gsnedders
2222 2 months ago java.nio.charset.UnsupportedCharsetException open nullquery
2330 2 months ago full-build fails to copy CPython License open kprussing
2258 2 months ago StackOverflowError stacktrace is eaten up by Jython open doublep
2293 2 months ago "java.lang.IllegalArgumentException: java.lang.IllegalArgumentException: Cannot create PyString with non-byte value" triggered after adding unicode element with non-ASCII character to sys.path open Arfrever
2299 2 months ago Support macropy open zyasoft
2331 2 months ago "java.lang.IllegalArgumentException: Cannot create PyString with non-byte value" caused by non-ASCII characters in _socket.error.args[1] with unicode type open Arfrever
2286 2 months ago 'IllegalArgumentException: java.lang.IllegalArgumentException: Cannot create PyString with non-byte value' triggered by test suite of autopep8 1.1.1 open Arfrever
2329 2 months ago Cannot create virtualenv with jython2.7rc2 - breaks tox open csojinb
2223 2 months ago __file__ not defined when running from ScriptEngine open jythonuser1
2285 2 months ago _strptime broken with non-English locales open Arfrever
2318 2 months ago test_zipimport_jy failure on Windows open jeff.allen
2317 2 months ago test_urllib2 failure on Windows open jeff.allen
2316 2 months ago test_tarfile file-mode failures on Windows open jeff.allen
2312 2 months ago Test failures related to encoding in a subprocess on Windows open jeff.allen
2315 2 months ago test_ssl failure on Windows open jeff.allen
2314 2 months ago test_shutil failures on Windows open jeff.allen
2313 2 months ago test_jython_initializer failure on Windows open jeff.allen
Download as CSV
Sort on: Descending:
Descending:
Group on: Descending:
Descending: